{"text_format":"1","workbook":"xlsx","n_sheets":4,"sheets":["説明","デッキビルダー","印刷用シート","カードリスト"],"not_rendered":{"charts":0,"images":1,"macros":1,"external_links":0,"defined_names":2,"comments":0,"pivot_tables":0},"unopened":[],"bounds":{"document_bytes":16777216,"sheet_cells":100000,"rows_first":2000,"rows_last":500,"rows_between":2000,"halvings":0,"cell_chars":16384,"cell_head_chars":4096},"cells_cut":0,"cells_raw":0,"read":"whole","date_system":"1900"}

{"sheet":"説明","index":0,"n_rows":4,"n_cols":2,"rows_kept":4,"cut":false,"hidden":false,"merged":[]}
[]
[null,"レギオンズ！公式デッキビルダーエクセルシートver2.2"]
[null,"（Ｃ）FLIPFLOPs\nhttp://legions.flipflops.jp/"]
[null,"使い方\n\nこのエクセルファイルを利用して、「レギオンズ！」のデッキを構築する事が出来ます。\n印刷して、そのまま、公式大会のデッキ登録にご利用頂けます。\nまず、デッキビルダーシートを利用して、デッキを組みます。\nカード名と入れる枚数をプルダウンで選んで、デッキを組んでください。\n\n印刷する時は、印刷用シートに切り替え、そこにデッキビルダーで作ったカードリストを読み込んで印刷してください。（印刷用シート右上の読み込みボタンを押します。マクロが有効になっている必要があります）"]

{"sheet":"デッキビルダー","index":1,"n_rows":45,"n_cols":12,"rows_kept":45,"cut":false,"hidden":false,"merged":[]}
[null,"レギオンズ！公式デッキビルダー"]
[null,"使用マスター"]
[]
[]
[null,"カード名","枚数","色","カテゴリー","コスト",null,"合計枚数",{"$f":"SUM(I7:I10)","v":0}]
[1,null,null,{"$f":"IF($B6=\"\",\"\",VLOOKUP($B6,カードリスト!$A$10:$P$994,3,FALSE))","v":""},{"$f":"IF($B6=\"\",\"\",VLOOKUP($B6,カードリスト!$A$10:$P$994,4,FALSE))","v":""},{"$f":"IF($B6=\"\",\"\",VLOOKUP($B6,カードリスト!$A$10:$P$994,5,FALSE))","v":""}]
[2,null,null,{"$f":"IF($B7=\"\",\"\",VLOOKUP($B7,カードリスト!$A$10:$P$994,3,FALSE))","v":""},{"$f":"IF($B7=\"\",\"\",VLOOKUP($B7,カードリスト!$A$10:$P$994,4,FALSE))","v":""},{"$f":"IF($B7=\"\",\"\",VLOOKUP($B7,カードリスト!$A$10:$P$994,5,FALSE))","v":""},null,"ミニオン",{"$f":"SUMIF($E$6:$E$45,$H7,$C$6:$C$45)","v":0}]
[3,null,null,{"$f":"IF($B8=\"\",\"\",VLOOKUP($B8,カードリスト!$A$10:$P$994,3,FALSE))","v":""},{"$f":"IF($B8=\"\",\"\",VLOOKUP($B8,カードリスト!$A$10:$P$994,4,FALSE))","v":""},{"$f":"IF($B8=\"\",\"\",VLOOKUP($B8,カードリスト!$A$10:$P$994,5,FALSE))","v":""},null,"スキル",{"$f":"SUMIF($E$6:$E$45,$H8,$C$6:$C$45)","v":0}]
[4,null,null,{"$f":"IF($B9=\"\",\"\",VLOOKUP($B9,カードリスト!$A$10:$P$994,3,FALSE))","v":""},{"$f":"IF($B9=\"\",\"\",VLOOKUP($B9,カードリスト!$A$10:$P$994,4,FALSE))","v":""},{"$f":"IF($B9=\"\",\"\",VLOOKUP($B9,カードリスト!$A$10:$P$994,5,FALSE))","v":""},null,"ロード",{"$f":"SUMIF($E$6:$E$45,$H9,$C$6:$C$45)","v":0}]
[5,null,null,{"$f":"IF($B10=\"\",\"\",VLOOKUP($B10,カードリスト!$A$10:$P$994,3,FALSE))","v":""},{"$f":"IF($B10=\"\",\"\",VLOOKUP($B10,カードリスト!$A$10:$P$994,4,FALSE))","v":""},{"$f":"IF($B10=\"\",\"\",VLOOKUP($B10,カードリスト!$A$10:$P$994,5,FALSE))","v":""},null,"アーツ",{"$f":"SUMIF($E$6:$E$45,$H10,$C$6:$C$45)","v":0}]
[6,null,null,{"$f":"IF($B11=\"\",\"\",VLOOKUP($B11,カードリスト!$A$10:$P$994,3,FALSE))","v":""},{"$f":"IF($B11=\"\",\"\",VLOOKUP($B11,カードリスト!$A$10:$P$994,4,FALSE))","v":""},{"$f":"IF($B11=\"\",\"\",VLOOKUP($B11,カードリスト!$A$10:$P$994,5,FALSE))","v":""}]
[7,null,null,{"$f":"IF($B12=\"\",\"\",VLOOKUP($B12,カードリスト!$A$10:$P$994,3,FALSE))","v":""},{"$f":"IF($B12=\"\",\"\",VLOOKUP($B12,カードリスト!$A$10:$P$994,4,FALSE))","v":""},{"$f":"IF($B12=\"\",\"\",VLOOKUP($B12,カードリスト!$A$10:$P$994,5,FALSE))","v":""}]
[8,null,null,{"$f":"IF($B13=\"\",\"\",VLOOKUP($B13,カードリスト!$A$10:$P$994,3,FALSE))","v":""},{"$f":"IF($B13=\"\",\"\",VLOOKUP($B13,カードリスト!$A$10:$P$994,4,FALSE))","v":""},{"$f":"IF($B13=\"\",\"\",VLOOKUP($B13,カードリスト!$A$10:$P$994,5,FALSE))","v":""},null,"コスト",null,null,"ミニオン・スキルのみ"]
[9,null,null,{"$f":"IF($B14=\"\",\"\",VLOOKUP($B14,カードリスト!$A$10:$P$994,3,FALSE))","v":""},{"$f":"IF($B14=\"\",\"\",VLOOKUP($B14,カードリスト!$A$10:$P$994,4,FALSE))","v":""},{"$f":"IF($B14=\"\",\"\",VLOOKUP($B14,カードリスト!$A$10:$P$994,5,FALSE))","v":""},null,1,{"$f":"SUMIF($F$6:$F$45,$H14,$C$6:$C$45)","v":0},null,1,{"$f":"SUMIFS($C$6:$C$45,$F$6:$F$45,$H14,$E$6:$E$45,\"スキル\")+SUMIFS($C$6:$C$45,$F$6:$F$45,$H14,$E$6:$E$45,\"ミニオン\")","v":0}]
[10,null,null,{"$f":"IF($B15=\"\",\"\",VLOOKUP($B15,カードリスト!$A$10:$P$994,3,FALSE))","v":""},{"$f":"IF($B15=\"\",\"\",VLOOKUP($B15,カードリスト!$A$10:$P$994,4,FALSE))","v":""},{"$f":"IF($B15=\"\",\"\",VLOOKUP($B15,カードリスト!$A$10:$P$994,5,FALSE))","v":""},null,2,0,null,2,{"$f":"SUMIFS($C$6:$C$45,$F$6:$F$45,$H15,$E$6:$E$45,\"スキル\")+SUMIFS($C$6:$C$45,$F$6:$F$45,$H15,$E$6:$E$45,\"ミニオン\")","v":0}]
[11,null,null,{"$f":"IF($B16=\"\",\"\",VLOOKUP($B16,カードリスト!$A$10:$P$994,3,FALSE))","v":""},{"$f":"IF($B16=\"\",\"\",VLOOKUP($B16,カードリスト!$A$10:$P$994,4,FALSE))","v":""},{"$f":"IF($B16=\"\",\"\",VLOOKUP($B16,カードリスト!$A$10:$P$994,5,FALSE))","v":""},null,3,0,null,3,0]
[12,null,null,{"$f":"IF($B17=\"\",\"\",VLOOKUP($B17,カードリスト!$A$10:$P$994,3,FALSE))","v":""},{"$f":"IF($B17=\"\",\"\",VLOOKUP($B17,カードリスト!$A$10:$P$994,4,FALSE))","v":""},{"$f":"IF($B17=\"\",\"\",VLOOKUP($B17,カードリスト!$A$10:$P$994,5,FALSE))","v":""},null,4,0,null,4,0]
[13,null,null,{"$f":"IF($B18=\"\",\"\",VLOOKUP($B18,カードリスト!$A$10:$P$994,3,FALSE))","v":""},{"$f":"IF($B18=\"\",\"\",VLOOKUP($B18,カードリスト!$A$10:$P$994,4,FALSE))","v":""},{"$f":"IF($B18=\"\",\"\",VLOOKUP($B18,カードリスト!$A$10:$P$994,5,FALSE))","v":""},null,5,0,null,5,0]
[14,null,null,{"$f":"IF($B19=\"\",\"\",VLOOKUP($B19,カードリスト!$A$10:$P$994,3,FALSE))","v":""},{"$f":"IF($B19=\"\",\"\",VLOOKUP($B19,カードリスト!$A$10:$P$994,4,FALSE))","v":""},{"$f":"IF($B19=\"\",\"\",VLOOKUP($B19,カードリスト!$A$10:$P$994,5,FALSE))","v":""},null,6,0,null,6,0]
[15,null,null,{"$f":"IF($B20=\"\",\"\",VLOOKUP($B20,カードリスト!$A$10:$P$994,3,FALSE))","v":""},{"$f":"IF($B20=\"\",\"\",VLOOKUP($B20,カードリスト!$A$10:$P$994,4,FALSE))","v":""},{"$f":"IF($B20=\"\",\"\",VLOOKUP($B20,カードリスト!$A$10:$P$994,5,FALSE))","v":""},null,7,0,null,7,0]
[16,null,null,{"$f":"IF($B21=\"\",\"\",VLOOKUP($B21,カードリスト!$A$10:$P$994,3,FALSE))","v":""},{"$f":"IF($B21=\"\",\"\",VLOOKUP($B21,カードリスト!$A$10:$P$994,4,FALSE))","v":""},{"$f":"IF($B21=\"\",\"\",VLOOKUP($B21,カードリスト!$A$10:$P$994,5,FALSE))","v":""},null,8,0,null,8,0]
[17,null,null,{"$f":"IF($B22=\"\",\"\",VLOOKUP($B22,カードリスト!$A$10:$P$994,3,FALSE))","v":""},{"$f":"IF($B22=\"\",\"\",VLOOKUP($B22,カードリスト!$A$10:$P$994,4,FALSE))","v":""},{"$f":"IF($B22=\"\",\"\",VLOOKUP($B22,カードリスト!$A$10:$P$994,5,FALSE))","v":""}]
[18,null,null,{"$f":"IF($B23=\"\",\"\",VLOOKUP($B23,カードリスト!$A$10:$P$994,3,FALSE))","v":""},{"$f":"IF($B23=\"\",\"\",VLOOKUP($B23,カードリスト!$A$10:$P$994,4,FALSE))","v":""},{"$f":"IF($B23=\"\",\"\",VLOOKUP($B23,カードリスト!$A$10:$P$994,5,FALSE))","v":""}]
[19,null,null,{"$f":"IF($B24=\"\",\"\",VLOOKUP($B24,カードリスト!$A$10:$P$994,3,FALSE))","v":""},{"$f":"IF($B24=\"\",\"\",VLOOKUP($B24,カードリスト!$A$10:$P$994,4,FALSE))","v":""},{"$f":"IF($B24=\"\",\"\",VLOOKUP($B24,カードリスト!$A$10:$P$994,5,FALSE))","v":""}]
[20,null,null,{"$f":"IF($B25=\"\",\"\",VLOOKUP($B25,カードリスト!$A$10:$P$994,3,FALSE))","v":""},{"$f":"IF($B25=\"\",\"\",VLOOKUP($B25,カードリスト!$A$10:$P$994,4,FALSE))","v":""},{"$f":"IF($B25=\"\",\"\",VLOOKUP($B25,カードリスト!$A$10:$P$994,5,FALSE))","v":""}]
[21,null,null,{"$f":"IF($B26=\"\",\"\",VLOOKUP($B26,カードリスト!$A$10:$P$994,3,FALSE))","v":""},{"$f":"IF($B26=\"\",\"\",VLOOKUP($B26,カードリスト!$A$10:$P$994,4,FALSE))","v":""},{"$f":"IF($B26=\"\",\"\",VLOOKUP($B26,カードリスト!$A$10:$P$994,5,FALSE))","v":""}]
[22,null,null,{"$f":"IF($B27=\"\",\"\",VLOOKUP($B27,カードリスト!$A$10:$P$994,3,FALSE))","v":""},{"$f":"IF($B27=\"\",\"\",VLOOKUP($B27,カードリスト!$A$10:$P$994,4,FALSE))","v":""},{"$f":"IF($B27=\"\",\"\",VLOOKUP($B27,カードリスト!$A$10:$P$994,5,FALSE))","v":""}]
[23,null,null,{"$f":"IF($B28=\"\",\"\",VLOOKUP($B28,カードリスト!$A$10:$P$994,3,FALSE))","v":""},{"$f":"IF($B28=\"\",\"\",VLOOKUP($B28,カードリスト!$A$10:$P$994,4,FALSE))","v":""},{"$f":"IF($B28=\"\",\"\",VLOOKUP($B28,カードリスト!$A$10:$P$994,5,FALSE))","v":""}]
[24,null,null,{"$f":"IF($B29=\"\",\"\",VLOOKUP($B29,カードリスト!$A$10:$P$994,3,FALSE))","v":""},{"$f":"IF($B29=\"\",\"\",VLOOKUP($B29,カードリスト!$A$10:$P$994,4,FALSE))","v":""},{"$f":"IF($B29=\"\",\"\",VLOOKUP($B29,カードリスト!$A$10:$P$994,5,FALSE))","v":""}]
[25,null,null,{"$f":"IF($B30=\"\",\"\",VLOOKUP($B30,カードリスト!$A$10:$P$994,3,FALSE))","v":""},{"$f":"IF($B30=\"\",\"\",VLOOKUP($B30,カードリスト!$A$10:$P$994,4,FALSE))","v":""},{"$f":"IF($B30=\"\",\"\",VLOOKUP($B30,カードリスト!$A$10:$P$994,5,FALSE))","v":""}]
[26,null,null,{"$f":"IF($B31=\"\",\"\",VLOOKUP($B31,カードリスト!$A$10:$P$994,3,FALSE))","v":""},{"$f":"IF($B31=\"\",\"\",VLOOKUP($B31,カードリスト!$A$10:$P$994,4,FALSE))","v":""},{"$f":"IF($B31=\"\",\"\",VLOOKUP($B31,カードリスト!$A$10:$P$994,5,FALSE))","v":""}]
[27,null,null,{"$f":"IF($B32=\"\",\"\",VLOOKUP($B32,カードリスト!$A$10:$P$994,3,FALSE))","v":""},{"$f":"IF($B32=\"\",\"\",VLOOKUP($B32,カードリスト!$A$10:$P$994,4,FALSE))","v":""},{"$f":"IF($B32=\"\",\"\",VLOOKUP($B32,カードリスト!$A$10:$P$994,5,FALSE))","v":""}]
[28,null,null,{"$f":"IF($B33=\"\",\"\",VLOOKUP($B33,カードリスト!$A$10:$P$994,3,FALSE))","v":""},{"$f":"IF($B33=\"\",\"\",VLOOKUP($B33,カードリスト!$A$10:$P$994,4,FALSE))","v":""},{"$f":"IF($B33=\"\",\"\",VLOOKUP($B33,カードリスト!$A$10:$P$994,5,FALSE))","v":""}]
[29,null,null,{"$f":"IF($B34=\"\",\"\",VLOOKUP($B34,カードリスト!$A$10:$P$994,3,FALSE))","v":""},{"$f":"IF($B34=\"\",\"\",VLOOKUP($B34,カードリスト!$A$10:$P$994,4,FALSE))","v":""},{"$f":"IF($B34=\"\",\"\",VLOOKUP($B34,カードリスト!$A$10:$P$994,5,FALSE))","v":""}]
[30,null,null,{"$f":"IF($B35=\"\",\"\",VLOOKUP($B35,カードリスト!$A$10:$P$994,3,FALSE))","v":""},{"$f":"IF($B35=\"\",\"\",VLOOKUP($B35,カードリスト!$A$10:$P$994,4,FALSE))","v":""},{"$f":"IF($B35=\"\",\"\",VLOOKUP($B35,カードリスト!$A$10:$P$994,5,FALSE))","v":""}]
[31,null,null,{"$f":"IF($B36=\"\",\"\",VLOOKUP($B36,カードリスト!$A$10:$P$994,3,FALSE))","v":""},{"$f":"IF($B36=\"\",\"\",VLOOKUP($B36,カードリスト!$A$10:$P$994,4,FALSE))","v":""},{"$f":"IF($B36=\"\",\"\",VLOOKUP($B36,カードリスト!$A$10:$P$994,5,FALSE))","v":""}]
[32,null,null,{"$f":"IF($B37=\"\",\"\",VLOOKUP($B37,カードリスト!$A$10:$P$994,3,FALSE))","v":""},{"$f":"IF($B37=\"\",\"\",VLOOKUP($B37,カードリスト!$A$10:$P$994,4,FALSE))","v":""},{"$f":"IF($B37=\"\",\"\",VLOOKUP($B37,カードリスト!$A$10:$P$994,5,FALSE))","v":""}]
[33,null,null,{"$f":"IF($B38=\"\",\"\",VLOOKUP($B38,カードリスト!$A$10:$P$994,3,FALSE))","v":""},{"$f":"IF($B38=\"\",\"\",VLOOKUP($B38,カードリスト!$A$10:$P$994,4,FALSE))","v":""},{"$f":"IF($B38=\"\",\"\",VLOOKUP($B38,カードリスト!$A$10:$P$994,5,FALSE))","v":""}]
[34,null,null,{"$f":"IF($B39=\"\",\"\",VLOOKUP($B39,カードリスト!$A$10:$P$994,3,FALSE))","v":""},{"$f":"IF($B39=\"\",\"\",VLOOKUP($B39,カードリスト!$A$10:$P$994,4,FALSE))","v":""},{"$f":"IF($B39=\"\",\"\",VLOOKUP($B39,カードリスト!$A$10:$P$994,5,FALSE))","v":""}]
[35,null,null,{"$f":"IF($B40=\"\",\"\",VLOOKUP($B40,カードリスト!$A$10:$P$994,3,FALSE))","v":""},{"$f":"IF($B40=\"\",\"\",VLOOKUP($B40,カードリスト!$A$10:$P$994,4,FALSE))","v":""},{"$f":"IF($B40=\"\",\"\",VLOOKUP($B40,カードリスト!$A$10:$P$994,5,FALSE))","v":""}]
[36,null,null,{"$f":"IF($B41=\"\",\"\",VLOOKUP($B41,カードリスト!$A$10:$P$994,3,FALSE))","v":""},{"$f":"IF($B41=\"\",\"\",VLOOKUP($B41,カードリスト!$A$10:$P$994,4,FALSE))","v":""},{"$f":"IF($B41=\"\",\"\",VLOOKUP($B41,カードリスト!$A$10:$P$994,5,FALSE))","v":""}]
[37,null,null,{"$f":"IF($B42=\"\",\"\",VLOOKUP($B42,カードリスト!$A$10:$P$994,3,FALSE))","v":""},{"$f":"IF($B42=\"\",\"\",VLOOKUP($B42,カードリスト!$A$10:$P$994,4,FALSE))","v":""},{"$f":"IF($B42=\"\",\"\",VLOOKUP($B42,カードリスト!$A$10:$P$994,5,FALSE))","v":""}]
[38,null,null,{"$f":"IF($B43=\"\",\"\",VLOOKUP($B43,カードリスト!$A$10:$P$994,3,FALSE))","v":""},{"$f":"IF($B43=\"\",\"\",VLOOKUP($B43,カードリスト!$A$10:$P$994,4,FALSE))","v":""},{"$f":"IF($B43=\"\",\"\",VLOOKUP($B43,カードリスト!$A$10:$P$994,5,FALSE))","v":""}]
[39,null,null,{"$f":"IF($B44=\"\",\"\",VLOOKUP($B44,カードリスト!$A$10:$P$994,3,FALSE))","v":""},{"$f":"IF($B44=\"\",\"\",VLOOKUP($B44,カードリスト!$A$10:$P$994,4,FALSE))","v":""},{"$f":"IF($B44=\"\",\"\",VLOOKUP($B44,カードリスト!$A$10:$P$994,5,FALSE))","v":""}]
[40,null,null,{"$f":"IF($B45=\"\",\"\",VLOOKUP($B45,カードリスト!$A$10:$P$994,3,FALSE))","v":""},{"$f":"IF($B45=\"\",\"\",VLOOKUP($B45,カードリスト!$A$10:$P$994,4,FALSE))","v":""},{"$f":"IF($B45=\"\",\"\",VLOOKUP($B45,カードリスト!$A$10:$P$994,5,FALSE))","v":""}]

{"sheet":"印刷用シート","index":2,"n_rows":36,"n_cols":2,"rows_kept":36,"cut":false,"hidden":false,"merged":[[34,1,34,2],[1,1,1,2],[4,1,4,2],[3,1,3,2],[32,1,32,2],[6,1,6,2]]}
[]
[null,"～ デッキ記入シート ～"]
[]
[null,"ハンドルネーム"]
[]
[]
[null,"●デッキシートに記載した以外のデッキの使用は禁止します。"]
[]
[null,"マスター"]
[]
[null,"カードリスト"]
[]
[]
[]
[]
[]
[]
[]
[]
[]
[]
[]
[]
[]
[]
[]
[]
[]
[]
[]
[]
[]
[null,"※デッキ内容や対戦内容、大会の様子をWEBなどで公開する場合があります。予めご了承ください。"]
[]
[null,"運営スタッフ記入欄"]
[null,"プレイヤーNo."]

{"sheet":"カードリスト","index":3,"n_rows":289,"n_cols":16,"rows_kept":289,"cut":false,"hidden":false,"merged":[]}
["name","type","color","category","cost","atk","hp","ＷＴ","cc","keywards","effect１","effect2","effect3","rality","flaver","illustllator"]
["時任サクジ","ルーンブレイダー","赤/白","マスター",null,null,null,null,null,null,null,null,null,null,null,"日向悠二"]
["星崎イノリ","フェアリーテイマー","赤/緑","マスター",null,null,null,null,null,null,null,null,null,null,null,"日向悠二"]
["勝浦カヨ","シャーマン","黒/緑","マスター",null,null,null,null,null,null,null,null,null,null,null,"日向悠二"]
["エリザベス・ロンズデール","デモンルーラー","黒/白","マスター",null,null,null,null,null,null,null,null,null,null,null,"日向悠二"]
["シグ・マクダネル","ジェネラル","白/緑","マスター",null,null,null,null,null,null,null,null,null,null,null,"日向悠二"]
["マオ・ニャン","ウィザード","黒/赤","マスター",null,null,null,null,null,null,null,null,null,null,null,"日向悠二"]
["ヨルン・アーベル","ネクロマンサー","黒/青","マスター",null,null,null,null,null,null,null,null,null,"O",null,"日向悠二"]
["ヒルダ・アーベル","ドールマスター","白/青","マスター",null,null,null,null,null,null,null,null,null,"O",null,"日向悠二"]
["死者の蘇生","魔術師","黒","スキル",1,null,null,3,null,null,"あなたのタイムラインにある、コストが６以下のミニオンカードを１枚選び、あなたのフィールドにリバース状態で置く。",null,null,"R","魔術師にとって死は終わりではない。","medilore"]
["リトルスカルデビル","悪魔","黒","ミニオン",1,2,1,2,null,"威圧2",null,null,null,"C","「死んだ後に残るのは骨だけだよ」",6624]
["下忍カスミ","忍者","黒","ミニオン",1,0,1,3,null,null,"「くない投げ」\n《配置時／レーン移動時》：相手のフィールドにあるユニット１体を選んで１ダメージを与える。",null,null,"C","「したっぱだからって甘く見ないでください！」",6624]
["スチームメイド・ステラ","蒸気機械/メイド","黒","ミニオン",2,2,2,3,null,null,"「お片づけ」\n《配置時／レーン移動時》：あなたのタイムラインのウェイトゾーンⅡ～Ⅳにある黒属性を持つカードを１枚選びＷＴ－１する。",null,null,"C","「お掃除の邪魔ですご主人様」","リウイチ"]
["小さき怨恨アリス","ゴースト","黒","ミニオン",2,1,1,4,null,"再生/移動攻撃",null,null,null,"C","「アリスと一緒に遊んでくれるの？」","リウイチ"]
["ファミリアキャット『セリーヌ』","獣","黒","ロード",2,2,2,null,0,"速攻","「黒猫の導き」\n《自ターン中任意》【疲労】：あなたのタイムラインにあるスキルカードを１枚選びＷＴ－１する。スキルカードが黒属性を持つ場合、代わりにＷＴ－２する。",null,null,"L","「マスターの為にがんばるにゃ！」","高畑雪"]
["ダークフレイム","悪魔/魔術師","黒","スキル",3,null,null,3,null,null,"相手のフィールドにあるユニット１体を選び２ダメージを与える。",null,null,"C","熱の無い炎は魂を灼く。","葉庭"]
["十字手裏剣","忍者","黒","スキル",3,null,null,3,null,null,"相手のフィールドにある全ユニットに１ダメージを与える。",null,null,"R","忍びの里では、この手裏剣を使いこなせなければ、一人前とは呼ばれない。","葉庭"]
["蒸気装甲兵","蒸気機械/戦士","黒","ミニオン",3,2,3,2,null,"威圧3",null,null,null,"C","「シュコオオォォ…！フシュオオオォォ…！」","大出リコ"]
["スチームライダー","蒸気機械/騎馬","黒","ミニオン",3,2,1,3,null,"直進","「疾走する鉄馬」\n《あなたが黒属性を持つスキルかアーツをプレイした時》：このカードが、あなたのタイムラインのウェイトゾーンⅠ～Ⅱにある場合、このカードをあなたのフィールドに配置しても良い。","「黒鋼の輝き」\n《このカードが、タイムラインから直接フィールドに配置された時》：このカードは、ターン終了時まで「速攻※」を得る。※速攻（このミニオンはフィールドに配置したターン中でも、疲労をともなう全行動が可能。）",null,"R","「その程度じゃ俺の愛馬は止めらんねえぜ！」","大出リコ"]
["蒸気銃士カイム","蒸気機械","黒","ミニオン",3,2,2,3,null,null,"「スチームライフル」\n《配置時／レーン移動時》：相手のフィールドにあるユニット１体を選び１ダメージを与える。",null,null,"C","「構え、狙え、撃て」","リウイチ"]
["チェインライトニング","魔術師","黒","スキル",4,null,null,3,null,null,"相手のフィールドにあるミニオン１体かロード１体を選び２ダメージを与える。この効果で、ミニオンかロードをブレイクした場合、相手のマスターに２ダメージを与える。",null,null,"R","「雷よ貫き爆ぜよ！」","葉庭"]
["黒騎士ライオネル","蒸気機械/騎士","黒","ミニオン",4,4,3,2,null,"威圧3",null,null,null,"C","「我を畏れぬならば向かってくるが良い」","蒲焼鰻"]
["デスクラウド","魔術師","黒","アーツ",5,null,null,null,null,null,"全てのフィールドにある全ユニットに４ダメージを与える。",null,null,"R","強い毒は使い手をも蝕む。","葉庭"]
["がしゃどくろ","妖怪","黒","ミニオン",5,3,3,4,null,"再生",null,null,null,"C","「からんころん…骨の音…」","TOKIAME"]
["装甲巨人リノセロンテ","蒸気機械","黒","ミニオン",6,5,6,3,null,"中央配置特性2",null,null,null,"R","「起動シーケンスオールグリーン。リノセロンテ出撃するよ」","大出リコ"]
["吸血姫『アコニー』","吸血鬼/姫","黒","ロード",6,6,5,null,2,"速攻","「魅了の魔眼」\n《自ターン中任意》【１ＭＰ】：相手のフィールドにあるミニオン１体を選び、ターン終了時まで「ブロック不可※」を与える。※ブロック不可（そのミニオンはブロッカーになれない。）",null,null,"L","「ふふふ、私に仕える名誉と幸運に泣いて喜ぶといいわ！」",6624]
["リトルドラコ","竜族","赤","ミニオン",1,1,1,3,null,null,"「炎の吐息」\n《配置時》：相手のフィールドにあるミニオン１体を選び１ダメージを与える。",null,null,"R","「熱いの好き？それとも嫌い？」","しろいはくと"]
["見習い剣士ヒナコ","侍","赤","ミニオン",1,2,1,2,null,"移動攻撃",null,null,null,"C","「私だって練習したんです！」",6624]
["火竜炎撃","陰陽師","赤","アーツ",2,null,null,null,null,null,"相手のフィールドにある全ミニオンに２ダメージを与える。",null,null,"R","「炎の竜よ舞い踊れ」","葉庭"]
["白刃一閃","侍/剣術","赤","スキル",2,null,null,2,null,null,"あなたのマスターは、「ＡＴＫ２」でアタックを行う。",null,null,"C","ただシンプルな一閃。でも命を刈るには必要十分。","葉庭"]
["ゴブリンソルジャー・リナ","鬼族","赤","ミニオン",2,2,2,2,null,"移動攻撃","「集合の笛」\n《配置時／レーン移動時》：あなたのタイムラインのウェイトゾーンⅡ～Ⅳにある、タイプ「鬼族」を持つカードを１枚選びＷＴ－１しても良い。",null,null,"C","ぱおー♪「みんな集合ー！」","しろいはくと"]
["かまいたちの末妹シグレ","妖怪/かまいたち","赤","ミニオン",2,2,1,3,null,"速攻/直進",null,null,null,"C","「ふぇ～ん。ちい姉ちゃん～ちょっとまってよ～」",6624]
["猫又オリョウ","妖怪/獣","赤","ミニオン",2,2,2,3,null,null,"「猫の手のお手伝い」\n《配置時／レーン移動時》：あなたは、あなたのタイムラインのウェイトゾーンⅡ～Ⅳにある赤属性を持つカードを１枚選びＷＴ－１する。",null,null,"C","「にゃーん！猫の手はいらんかにゃー？」",6624]
["座敷わらし『シノ』","妖怪/座敷わらし","赤","ロード",2,0,3,null,0,"速攻","「幸運の運び手」\n《自ターン中任意》【疲労】:あなたのタイムラインにあるカードを３枚まで選んでＷＴ－１する。",null,null,"L","「シノがまもってあげるね、ごしゅじんさま」",6624]
["オーガアサシン","鬼族/暗殺者","赤","ミニオン",3,2,3,2,null,"対マスター特効1",null,null,null,"C","「貴様の命…頂戴する」","高畑雪"]
["アサルトランサー","戦士","赤","ミニオン",3,1,3,2,null,"強襲/右配置特性1",null,null,null,"R","「右舷から攻め上がるぞ！ついてこい！」","高畑雪"]
["フレアランス","魔術師","赤","スキル",4,null,null,3,null,null,"相手のフィールドにあるミニオンを１体選び６ダメージを与える。",null,null,"C","「ほのおのやり！あいつをつらぬけぇっ！！」","葉庭"]
["烏天狗キッカ","妖怪/天狗","赤","ミニオン",4,3,2,3,null,"速攻",null,null,null,"R","「その隙、見逃さぬぞ！」","TOKIAME"]
["ヘヴィガンナー","戦士","赤","ミニオン",4,4,4,2,null,"直進/衝撃1",null,null,null,"C","「こいつの威力はちょっとしたもんだぜ？小回りが利かないぐらいご愛敬ってもんだ」","高畑雪"]
["炎竜アレクサンドラ","竜族","赤","ミニオン",5,4,5,3,null,null,"「ファイアーブレス」\n《配置時／レーン移動》：相手のフィールドにあるミニオン１体を選び２ダメージを与える。",null,null,"C","「竜の吐息は灼熱、ため息は焦熱」","しろいはくと"]
["フレイムメイジ『ルナール』","魔術師","赤","ロード",5,4,5,null,1,"強襲","「焼き尽くしてあげる！」\n《配置時》：相手のフィールドにあるミニオン１体を選び３ダメージを与える。",null,null,"L","「究極の魔術は炎の魔術って事を証明するわ！」",6624]
["エクスプロージョン","魔術師","赤","アーツ",6,null,null,null,null,null,"全てのフィールドにある全ミニオンに６ダメージを与える。",null,null,"R","極度の高熱。爆発は結果に過ぎない。","葉庭"]
["オーガクイーン","鬼族","赤","ミニオン",6,6,5,3,null,"衝撃2/移動攻撃",null,null,null,"R","「さあ、次に潰されたい奴はどいつだい？」","TOKIAME"]
["ライトヒール","神聖","白","スキル",1,null,null,4,null,null,"あなたのマスターは１点のライフを得る。その後、あなたのタイムラインのウェイトゾーンⅡ～Ⅳにある白属性を持つカードを１枚選びＷＴ－１する。",null,null,"C","王の手は癒しの手。","葉庭"]
["スクワイア","騎士","白","ミニオン",1,1,2,2,null,"移動攻撃",null,null,null,"C",null,"蒲焼鰻"]
["白狐ククリ","妖怪/妖狐","白","ミニオン",1,2,1,2,null,"効果ダメージ無効",null,null,null,"R","「わわ！？みつかっちゃった！？」",6624]
["シルフィーナイト","精霊/騎士","白","ミニオン",2,2,2,2,null,"右配置特性1",null,null,null,"C","「疾風を纏え我が剣よ！」","茜屋"]
["すねこすり","妖怪/獣","白","ミニオン",2,1,2,3,null,null,"「すねこすり」\n《配置時／レーン移動時》：相手のフィールドにあるコストが２以下のミニオン１体を選んで、相手のスタンバイゾーンに置く。この効果は、相手のスタンバイゾーンに空きがない場合は発動しない。",null,null,"R",null,6624]
["お守り天使ミュゼル","天使","白","ミニオン",2,2,2,3,null,null,"「お守り天使」\n《配置時／レーン移動時》：あなたのタイムラインのウェイトゾーンⅡ～Ⅳにある白属性を持つカードを１枚選びＷＴ－１する。",null,null,"C",null,"めぐもけ"]
["アンサモン","魔術師","白","アーツ",3,null,null,null,null,null,"相手のフィールドにあるミニオン１体を選び、相手のタイムラインのウェイトゾーンⅣに置く。",null,null,"C","「退去せよ汝、異界の者よ！ここは汝の世界に非ず！」","葉庭"]
["ハイビショップ","ビショップ","白","ミニオン",3,2,3,4,null,null,"「癒しの光を！」\n《配置時／レーン移動時》：あなたのマスターは１点のライフを得る。その後、あなたのタイムラインのウェイトゾーンⅡ～Ⅳにある白属性を持つカードを１枚選んでＷＴ－１する。",null,null,"R","「どこかお怪我はありませんか－」","めぐもけ"]
["小天使アロエル","天使","白","ミニオン",3,2,2,3,null,"先制",null,null,null,"C","「わたしの矢、とっても痛いですのよ？」","高畑雪"]
["クイックリカバー","ビショップ","白","スキル",4,null,null,3,null,null,"あなたのフィールドにある疲労状態のミニオン１体を選び活性状態にする。",null,null,"C",null,"葉庭"]
["アークエンジェル","天使","白","ミニオン",4,3,4,2,null,"効果ダメージ無効",null,null,null,"C","「私に邪悪な魔法は通じません」",6624]
["ホーリーバニッシュ","魔術師","白","アーツ",5,null,null,null,null,null,"相手のフィールドにあるコストが６以下のロード１体を選びブレイクする。",null,null,"R","その清浄なる一撃は、異界の王さえ揺るがし得る。","葉庭"]
["霧の精霊ミスティ","精霊","白","ミニオン",5,4,6,3,null,null,null,null,null,"C","「私の霧でギュ～ッてしてあげるっ」","高畑雪"]
["白騎士ローズマリー","騎士","白","ミニオン",5,4,5,3,null,"中央配置特性2/直進",null,null,null,"R",null,"茜屋"]
["白竜の娘『パンドラ』","竜族","白","ロード",5,4,5,null,1,null,"「白竜の息吹」\n《配置時》：相手のフィールドにあるミニオンからコストの合計が５以下になるように好きな数を選んでブレイクする。その後、そうしてブレイクしたミニオンの数に等しいライフを得る。",null,null,"L","「ひれ伏しなさい、パンドラの名において！」","水本正"]
["ホーリーゴレム・ルチア","ゴレム","白","ミニオン",6,4,7,3,null,"貫通2","\n",null,null,"R",null,"茜屋"]
["白の剛剣『カシナート』","戦士","白","ロード",6,5,6,null,1,"速攻/衝撃2",null,null,null,"L","「雑魚共が…退けっ…！！」","高畑雪"]
["ウォークライ","戦士","緑","スキル",1,null,null,2,null,null,"あなたのフィールドにあるミニオンかロード１体を選び、ターン終了時まで「＋１／＋１」の修正を与える。",null,null,"C","その叫びは、魂を震わせる。","葉庭"]
["クローネの森林警備員","クローネ","緑","ミニオン",1,1,2,2,null,"移動攻撃",null,null,null,"C","「森を荒らす子にはお仕置きだよっ！」",6624]
["新緑の精霊","精霊","緑","ミニオン",1,1,1,3,null,null,"「春の芽吹き」\n《あなたが緑属性を持つミニオンをフィールドに配置した時》：このカードがあなたのタイムラインのウェイトゾーンⅠ～Ⅱにある場合、あなたのフィールドに配置しても良い。","「新緑の輝き」\n《このカードが、タイムラインから直接フィールドに配置された時》：このカードは、ターン終了時まで「速攻※」を得る。※速攻（このミニオンはフィールドに配置したターン中でも、疲労をともなう全行動が可能。）",null,"R",null,"高畑雪"]
["花冠の戦士エリン","フェレス/戦士","緑","ミニオン",2,2,2,3,null,null,"「春の祝福」\n《配置時／レーン移動時》：あなたのタイムラインのウェイトゾーンⅡ～Ⅳにある、緑属性を持つカードを１枚選びＷＴ－１する。",null,null,"C",null,6624]
["フェレスの狩人セシル","フェレス/狩人","緑","ミニオン",2,2,2,2,null,null,"「狩りのお時間」\n《配置時／レーン移動時》：相手のフィールドにある、コストが１以下のミニオン１体を選んでブレイクする。",null,null,"C","「弓の極意？一撃で斃す事だぜ」",6624]
["樹上の狙撃手『アセロラ』","フェレス/レンジャー","緑","ロード",2,3,3,null,0,null,"「樹上からの狙撃」\n《あなたがフィールドにミニオンを配置した時》：相手のフィールドにあるミニオンを１体選んで１ダメージを与える。",null,null,"L","「弓の極意？死角から射る事よ」",6624]
["スマッシュブロー","戦士/格闘","緑","スキル",3,null,null,3,null,null,"あなたのマスターは「ＡＴＫ３・貫通２※」でアタックを行う。\n※貫通２（この効果によるバトルで相手のミニオン／ロードをアタックによりブレイクした時、２ダメージを相手のマスターに与える。）",null,null,"C",null,"medilore"]
["鷹の目のユラン","クローネ/戦士","緑","ミニオン",3,3,2,2,null,"貫通1",null,null,null,"C","「緋硬石の刃は鋭いぞ…？」",6624]
["クローネの魔法騎士","クローネ/騎士","緑","ミニオン",3,2,3,2,null,"効果ダメージ無効",null,null,null,"R","「私が相手の魔法を食い止めます！」",6624]
["大物狙いのオルク","セス/狩人","緑","ミニオン",3,2,3,3,null,null,"「大物狩り」\n《アタック時》：アタックターゲットがＨＰを５以上持つミニオンだった場合、そのミニオンをブレイクする。",null,null,"R",null,"高畑雪"]
["ザップ","戦士","緑","スキル",4,null,null,3,null,null,"相手のフィールドにあるミニオン１体を選び、相手のスタンバイゾーンに置く。相手のスタンバイゾーンに空きがなかった場合は、そのミニオンを相手のタイムラインのウェイトゾーンⅠに置く。",null,null,"C","神速の拳が機先を制す","medilore"]
["樹海の戦士カルドス","フェレス/戦士","緑","ミニオン",4,4,3,2,null,"対マスター特効1",null,null,null,"C","「森ノ敵…スベテ倒ス…！」","大出リコ"]
["ハイドルイド・サーリャ","ドルイド","緑","ミニオン",4,3,3,3,null,null,"「ドルイドの加護」\n《配置時／レーン移動時》：あなたのフィールドにある、このカード以外のミニオン１体を選んで、ターン終了時まで「＋２／＋２」の修正を与える。",null,null,"R",null,"水本正"]
["女王の護衛戦士リコッテ","フェレス/戦士","緑","ミニオン",5,4,5,3,null,null,"「護衛部隊の招集」\n《配置時／レーン移動時》：あなたのタイムラインのウェイトゾーンⅠ～Ⅱにある、コストが４以下のミニオンを１体選んで、あなたのフィールドに配置しても良い。",null,null,"C","「ものども出会え！女王陛下をお守りするのだ！」",6624]
["一斉攻撃","戦士","緑","アーツ",6,null,null,null,null,null,"あなたのスタンバイゾーンと、タイムラインのウェイトゾーンⅠ～Ⅲから、緑属性を持つミニオンを好きな枚数選び、あなたのフィールドに置く。こうして配置したミニオンは、ターン終了時まで「強襲※１」と「貫通２※２」を持つ。\n※１強襲（そのミニオンは、フィールドに配置したターン中でも、ミニオンゾーンのアタックのみ可能。）\n※２貫通２（そのミニオンが相手のミニオン／ロードをアタックによりブレイクした時、２ダメージを相手のマスターに与える。）",null,null,"R","「みんなでいくよ！せ～のっ！」","里村響"]
["樹木兵マリー＆チコリー","クローネ/精霊","緑","ミニオン",6,6,6,3,null,"直進",null,null,null,"R","「チコリーちゃん！あなたの力をみせてあげるの！」",6624]
["怪力無双の猫娘『シグニャー』","フェレス/戦士","緑","ロード",7,6,6,null,2,"速攻/直進","「突撃にゃー！」\n《配置時》：あなたのスタンバイゾーンにあるミニオンを好きな枚数選び、あなたのフィールドに配置しても良い。そうして配置したミニオンに、ターン終了時まで「速攻※」を与える。※速攻（そのミニオンはフィールドに配置したターン中でも、疲労をともなう全行動が可能。）",null,null,"L","「いっせいにいくのにゃー！」","水本正"]
["ブラッドスウォーム","魔術師","黒/赤","スキル",1,null,null,3,null,null,"相手のマスターに１ダメージを与え、相手のスタンバイゾーンかタイムラインにあるカードを１枚選んでＷＴ＋１する。",null,null,"C","毒使いの技は、盾でも鎧でも防げない。","葉庭"]
["ジャック・オ・ランタン","妖精/ゴースト","黒/赤","ミニオン",1,1,1,2,null,null,"「冥府の案内人」\n《配置時／レーン移動時》：相手のマスターに１ダメージを与える。",null,null,"C","「冥府も住めばいいところだよ～」","大出リコ"]
["マジックミサイル","魔術師","黒/赤","スキル",2,null,null,2,null,null,"相手のフィールドにあるユニットを２体まで選び、１ダメージを与える。",null,null,"C","魔法の矢が狙いを違えることはない。","葉庭"]
{"$rows_left_out":209}